{"text_format":"1","workbook":"xlsx","n_sheets":5,"sheets":["Info to fill in tabs","Port tab","Sampling tab","New species","Drop down items"],"not_rendered":{"charts":0,"images":1,"macros":1,"external_links":0,"defined_names":0,"comments":0,"pivot_tables":0},"unopened":[],"bounds":{"document_bytes":16777216,"sheet_cells":100000,"rows_first":2000,"rows_last":500,"rows_between":2000,"halvings":0,"cell_chars":16384,"cell_head_chars":4096},"cells_cut":0,"cells_raw":0,"read":"whole","date_system":"1900"}

{"sheet":"Info to fill in tabs","index":0,"n_rows":33,"n_cols":5,"rows_kept":33,"cut":false,"hidden":false,"merged":[]}
["Column name","Unit","Data type. If number (p,s) where\nprecision, p = length of the number in digits, and\nscale, s = places after the decimal point","Description","Optional / Mandatory"]
["Port tab "]
["UN/LOCODE",null,"text, 6 characters","Unique port identifier from United Nations Code for Trade and Transport Locations","Mandatory"]
["COUNTRY",null,"multiple options from drop down menu","Country of the port","Mandatory"]
["PORT_NAME",null,"text, 200 characters","Name of the port","Mandatory"]
["LOCATION",null,"text, 50 characters","Unique sampling site identifier , i.a. Site 1","Mandatory"]
["SALINITY_MAX_PSU","PSU","number between 0.0-40.0 ","Maximum salinity value measured during the port survey","Mandatory"]
["SALINITY_MIN_PSU","PSU","number between 0.0-40.0 ","Minimum salinity value measured during the port survey","Mandatory"]
["ORIGINATOR",null,"text, 200 characters","Organization responsible for the sampling","Mandatory"]
["LATITUDE_WGS84DEC","decimal degrees","number(8,6)","Latitude, WGS84, Latitude of each location sampled in the port","Mandatory"]
["LONGITUDE_WGS84DEC","decimal degrees","number(8,6)","Longitude, WGS84, Longitude of each location sampled in the port","Mandatory"]
[]
["Sampling tab "]
["UN/LOCODE",null,"text, 6 characters","Unique port identifier from United Nations Code for Trade and Transport Locations","Mandatory"]
["DATE_DAY",null,"date(DD)","Representative  Zeit for sampling start","Mandatory"]
["DATE_MONTH",null,"date(MM)","Representative  Zeit for sampling start","Mandatory"]
["DATE_YEAR",null,"date(YYYY)","Representative  Zeit for sampling start","Mandatory"]
["LOCATION",null,"text, 2000 characters","Sampling site identifier, i.a. Site 1. It should be the same as in the Port table","Mandatory"]
["FIELD_NUMBER",null,"text, 20 characters","Unique ID,  simple numbering 1,2,3… The same than SAMPLE_ID in the JHP_Port Survey data archive template","Mandatory"]
["SAMPLING_GROUP",null,"multiple options from drop down menu","Organism group name: Fouling, Phytoplankton, Zooplankton, Benthos or Mobile epifauna ","Mandatory"]
["SCIENTIFIC_NAME",null,"multiple options from drop down menu","Species scientific name selected from the species present in the database. Only taxa identified to species level","Mandatory"]
["SALINITY","PSU","number between 0.0-40.0 ","Salinity measured at the sampling location","Optional"]
["COMMENTS",null,"text, 2000 characters","Additional information. For 'Fouling' indicate whether it is 'scraping' or 'plates' sampling. For 'Phytoplankton' indicate whether it is 'water' or 'net' sampling.","Optional"]
[]
[]
["New Species tab"]
["SCIENTIFIC_NAME",null,"text, 200 characters","Please before entering a new Species name check http://www.marinespecies.org/ to ensure that the species status is accepted","Mandatory"]
["SPECIES_ID",null,"Number","Fill by the Secretariat","Mandatory"]
["APHIA_ID",null,"Number","Inique ID for each species in Worms (http://www.marinespecies.org). Only acepted taxonomical status are included as new species in the database","Mandatory"]
["ITIS_TSN",null,"Number","When a species is not present in Worms a IT IS TSN must be provided. Integrated Taxonomic Information System (https://www.itis.gov/)","Mandatory when APHIA_ID is not available"]
["OTHER_ID",null,"Number","When neither Worms nor ITIS contain a species an alternative source for its taxonomical status must be provided.","Mandatory when neither APHIA_ID nor IT IS_TSN are available"]
["SOURCE_OTHER_ID",null,"URL","URL to the database or species page with its taxonomical status","Mandatory when neither APHIA_ID nor IT IS_TSN are available"]
["SPECIES_GROUP",null,"multiple options from drop down menu","Organism group: Benthic Invertebrates, Birds, Fish and Lamprey, Macrophytes, Mammals, Phytoplankton, Zooplankton or Bacteria","Mandatory"]

{"sheet":"Port tab","index":1,"n_rows":1,"n_cols":9,"rows_kept":1,"cut":false,"hidden":false,"merged":[]}
["UN/LOCODE","COUNTRY","PORT_NAME","LOCATION","SALINITY_MAX_PSU","SALINITY_MIN_PSU","ORIGINATOR","LATITUDE_WGS84DEC","LONGITUDE_WGS84DEC"]

{"sheet":"Sampling tab","index":2,"n_rows":2000,"n_cols":11,"rows_kept":2000,"cut":false,"hidden":false,"merged":[]}
["UN/LOCODE","DATE_DAY","DATE_MONTH","DATE_YEAR","LOCATION","FIELD_NUMBER","SAMPLING_GROUP","SCIENTIFIC_NAME","SPECIES_ID","SALINITY_PSU","COMMENTS"]
[null,"",null,null,null,null,"","",{"$f":"VLOOKUP(H2,'Drop down items'!B2:C4868,2,FALSE)","v":{"$error":"#N/A"}}]
[null,null,null,null,null,null,null,null,{"$f":"VLOOKUP(H3,'Drop down items'!B3:C4869,2,FALSE)","v":{"$error":"#N/A"}}]
[null,null,null,null,null,null,null,null,{"$f":"VLOOKUP(H4,'Drop down items'!B4:C4870,2,FALSE)","v":{"$error":"#N/A"}}]
[null,null,null,null,null,null,null,null,{"$f":"VLOOKUP(H5,'Drop down items'!B5:C4871,2,FALSE)","v":{"$error":"#N/A"}}]
[null,null,null,null,null,null,null,null,{"$f":"VLOOKUP(H6,'Drop down items'!B6:C4872,2,FALSE)","v":{"$error":"#N/A"}}]
[null,null,null,null,null,null,null,null,{"$f":"VLOOKUP(H7,'Drop down items'!B7:C4873,2,FALSE)","v":{"$error":"#N/A"}}]
[null,null,null,null,null,null,null,null,{"$f":"VLOOKUP(H8,'Drop down items'!B8:C4874,2,FALSE)","v":{"$error":"#N/A"}}]
[null,null,null,null,null,null,null,null,{"$f":"VLOOKUP(H9,'Drop down items'!B9:C4875,2,FALSE)","v":{"$error":"#N/A"}}]
[null,null,null,null,null,null,null,null,{"$f":"VLOOKUP(H10,'Drop down items'!B10:C4876,2,FALSE)","v":{"$error":"#N/A"}}]
[null,null,null,null,null,null,null,null,{"$f":"VLOOKUP(H11,'Drop down items'!B11:C4877,2,FALSE)","v":{"$error":"#N/A"}}]
[null,null,null,null,null,null,null,null,{"$f":"VLOOKUP(H12,'Drop down items'!B12:C4878,2,FALSE)","v":{"$error":"#N/A"}}]
[null,null,null,null,null,null,null,null,{"$f":"VLOOKUP(H13,'Drop down items'!B13:C4879,2,FALSE)","v":{"$error":"#N/A"}}]
[null,null,null,null,null,null,null,null,{"$f":"VLOOKUP(H14,'Drop down items'!B14:C4880,2,FALSE)","v":{"$error":"#N/A"}}]
[null,null,null,null,null,null,null,null,{"$f":"VLOOKUP(H15,'Drop down items'!B15:C4881,2,FALSE)","v":{"$error":"#N/A"}}]
[null,null,null,null,null,null,null,"",{"$f":"VLOOKUP(H16,'Drop down items'!B16:C4882,2,FALSE)","v":{"$error":"#N/A"}}]
[null,null,null,null,null,null,null,"",{"$f":"VLOOKUP(H17,'Drop down items'!B17:C4883,2,FALSE)","v":{"$error":"#N/A"}}]
[null,null,null,null,null,null,null,null,{"$f":"VLOOKUP(H18,'Drop down items'!B18:C4884,2,FALSE)","v":{"$error":"#N/A"}}]
[null,null,null,null,null,null,null,null,{"$f":"VLOOKUP(H19,'Drop down items'!B19:C4885,2,FALSE)","v":{"$error":"#N/A"}}]
[null,null,null,null,null,null,null,null,{"$f":"VLOOKUP(H20,'Drop down items'!B20:C4886,2,FALSE)","v":{"$error":"#N/A"}}]
[null,null,null,null,null,null,null,null,{"$f":"VLOOKUP(H21,'Drop down items'!B21:C4887,2,FALSE)","v":{"$error":"#N/A"}}]
[null,null,null,null,null,null,null,null,{"$f":"VLOOKUP(H22,'Drop down items'!B22:C4888,2,FALSE)","v":{"$error":"#N/A"}}]
[null,null,null,null,null,null,null,null,{"$f":"VLOOKUP(H23,'Drop down items'!B23:C4889,2,FALSE)","v":{"$error":"#N/A"}}]
[null,null,null,null,null,null,null,null,{"$f":"VLOOKUP(H24,'Drop down items'!B24:C4890,2,FALSE)","v":{"$error":"#N/A"}}]
[null,null,null,null,null,null,null,null,{"$f":"VLOOKUP(H25,'Drop down items'!B25:C4891,2,FALSE)","v":{"$error":"#N/A"}}]
[null,null,null,null,null,null,null,null,{"$f":"VLOOKUP(H26,'Drop down items'!B26:C4892,2,FALSE)","v":{"$error":"#N/A"}}]
[null,null,null,null,null,null,null,null,{"$f":"VLOOKUP(H27,'Drop down items'!B27:C4893,2,FALSE)","v":{"$error":"#N/A"}}]
[null,null,null,null,null,null,null,null,{"$f":"VLOOKUP(H28,'Drop down items'!B28:C4894,2,FALSE)","v":{"$error":"#N/A"}}]
[null,null,null,null,null,null,null,null,{"$f":"VLOOKUP(H29,'Drop down items'!B29:C4895,2,FALSE)","v":{"$error":"#N/A"}}]
[null,null,null,null,null,null,null,null,{"$f":"VLOOKUP(H30,'Drop down items'!B30:C4896,2,FALSE)","v":{"$error":"#N/A"}}]
[null,null,null,null,null,null,null,null,{"$f":"VLOOKUP(H31,'Drop down items'!B31:C4897,2,FALSE)","v":{"$error":"#N/A"}}]
[null,null,null,null,null,null,null,null,{"$f":"VLOOKUP(H32,'Drop down items'!B32:C4898,2,FALSE)","v":{"$error":"#N/A"}}]
[null,null,null,null,null,null,null,null,{"$f":"VLOOKUP(H33,'Drop down items'!B33:C4899,2,FALSE)","v":{"$error":"#N/A"}}]
[null,null,null,null,null,null,null,null,{"$f":"VLOOKUP(H34,'Drop down items'!B34:C4900,2,FALSE)","v":{"$error":"#N/A"}}]
[null,null,null,null,null,null,null,null,{"$f":"VLOOKUP(H35,'Drop down items'!B35:C4901,2,FALSE)","v":{"$error":"#N/A"}}]
[null,null,null,null,null,null,null,null,{"$f":"VLOOKUP(H36,'Drop down items'!B36:C4902,2,FALSE)","v":{"$error":"#N/A"}}]
[null,null,null,null,null,null,null,null,{"$f":"VLOOKUP(H37,'Drop down items'!B37:C4903,2,FALSE)","v":{"$error":"#N/A"}}]
[null,null,null,null,null,null,null,null,{"$f":"VLOOKUP(H38,'Drop down items'!B38:C4904,2,FALSE)","v":{"$error":"#N/A"}}]
[null,null,null,null,null,null,null,null,{"$f":"VLOOKUP(H39,'Drop down items'!B39:C4905,2,FALSE)","v":{"$error":"#N/A"}}]
[null,null,null,null,null,null,null,null,{"$f":"VLOOKUP(H40,'Drop down items'!B40:C4906,2,FALSE)","v":{"$error":"#N/A"}}]
[null,null,null,null,null,null,null,null,{"$f":"VLOOKUP(H41,'Drop down items'!B41:C4907,2,FALSE)","v":{"$error":"#N/A"}}]
[null,null,null,null,null,null,null,null,{"$f":"VLOOKUP(H42,'Drop down items'!B42:C4908,2,FALSE)","v":{"$error":"#N/A"}}]
[null,null,null,null,null,null,null,null,{"$f":"VLOOKUP(H43,'Drop down items'!B43:C4909,2,FALSE)","v":{"$error":"#N/A"}}]
[null,null,null,null,null,null,null,null,{"$f":"VLOOKUP(H44,'Drop down items'!B44:C4910,2,FALSE)","v":{"$error":"#N/A"}}]
[null,null,null,null,null,null,null,null,{"$f":"VLOOKUP(H45,'Drop down items'!B45:C4911,2,FALSE)","v":{"$error":"#N/A"}}]
[null,null,null,null,null,null,null,null,{"$f":"VLOOKUP(H46,'Drop down items'!B46:C4912,2,FALSE)","v":{"$error":"#N/A"}}]
[null,null,null,null,null,null,null,null,{"$f":"VLOOKUP(H47,'Drop down items'!B47:C4913,2,FALSE)","v":{"$error":"#N/A"}}]
[null,null,null,null,null,null,null,null,{"$f":"VLOOKUP(H48,'Drop down items'!B48:C4914,2,FALSE)","v":{"$error":"#N/A"}}]
[null,null,null,null,null,null,null,null,{"$f":"VLOOKUP(H49,'Drop down items'!B49:C4915,2,FALSE)","v":{"$error":"#N/A"}}]
[null,null,null,null,null,null,null,null,{"$f":"VLOOKUP(H50,'Drop down items'!B50:C4916,2,FALSE)","v":{"$error":"#N/A"}}]
[null,null,null,null,null,null,null,null,{"$f":"VLOOKUP(H51,'Drop down items'!B51:C4917,2,FALSE)","v":{"$error":"#N/A"}}]
[null,null,null,null,null,null,null,null,{"$f":"VLOOKUP(H52,'Drop down items'!B52:C4918,2,FALSE)","v":{"$error":"#N/A"}}]
[null,null,null,null,null,null,null,null,{"$f":"VLOOKUP(H53,'Drop down items'!B53:C4919,2,FALSE)","v":{"$error":"#N/A"}}]
[null,null,null,null,null,null,null,null,{"$f":"VLOOKUP(H54,'Drop down items'!B54:C4920,2,FALSE)","v":{"$error":"#N/A"}}]
[null,null,null,null,null,null,null,null,{"$f":"VLOOKUP(H55,'Drop down items'!B55:C4921,2,FALSE)","v":{"$error":"#N/A"}}]
[null,null,null,null,null,null,null,null,{"$f":"VLOOKUP(H56,'Drop down items'!B56:C4922,2,FALSE)","v":{"$error":"#N/A"}}]
[null,null,null,null,null,null,null,null,{"$f":"VLOOKUP(H57,'Drop down items'!B57:C4923,2,FALSE)","v":{"$error":"#N/A"}}]
[null,null,null,null,null,null,null,null,{"$f":"VLOOKUP(H58,'Drop down items'!B58:C4924,2,FALSE)","v":{"$error":"#N/A"}}]
[null,null,null,null,null,null,null,null,{"$f":"VLOOKUP(H59,'Drop down items'!B59:C4925,2,FALSE)","v":{"$error":"#N/A"}}]
[null,null,null,null,null,null,null,null,{"$f":"VLOOKUP(H60,'Drop down items'!B60:C4926,2,FALSE)","v":{"$error":"#N/A"}}]
[null,null,null,null,null,null,null,null,{"$f":"VLOOKUP(H61,'Drop down items'!B61:C4927,2,FALSE)","v":{"$error":"#N/A"}}]
[null,null,null,null,null,null,null,null,{"$f":"VLOOKUP(H62,'Drop down items'!B62:C4928,2,FALSE)","v":{"$error":"#N/A"}}]
[null,null,null,null,null,null,null,null,{"$f":"VLOOKUP(H63,'Drop down items'!B63:C4929,2,FALSE)","v":{"$error":"#N/A"}}]
[null,null,null,null,null,null,null,null,{"$f":"VLOOKUP(H64,'Drop down items'!B64:C4930,2,FALSE)","v":{"$error":"#N/A"}}]
[null,null,null,null,null,null,null,null,{"$f":"VLOOKUP(H65,'Drop down items'!B65:C4931,2,FALSE)","v":{"$error":"#N/A"}}]
[null,null,null,null,null,null,null,null,{"$f":"VLOOKUP(H66,'Drop down items'!B66:C4932,2,FALSE)","v":{"$error":"#N/A"}}]
[null,null,null,null,null,null,null,null,{"$f":"VLOOKUP(H67,'Drop down items'!B67:C4933,2,FALSE)","v":{"$error":"#N/A"}}]
[null,null,null,null,null,null,null,null,{"$f":"VLOOKUP(H68,'Drop down items'!B68:C4934,2,FALSE)","v":{"$error":"#N/A"}}]
[null,null,null,null,null,null,null,null,{"$f":"VLOOKUP(H69,'Drop down items'!B69:C4935,2,FALSE)","v":{"$error":"#N/A"}}]
[null,null,null,null,null,null,null,null,{"$f":"VLOOKUP(H70,'Drop down items'!B70:C4936,2,FALSE)","v":{"$error":"#N/A"}}]
[null,null,null,null,null,null,null,null,{"$f":"VLOOKUP(H71,'Drop down items'!B71:C4937,2,FALSE)","v":{"$error":"#N/A"}}]
[null,null,null,null,null,null,null,null,{"$f":"VLOOKUP(H72,'Drop down items'!B72:C4938,2,FALSE)","v":{"$error":"#N/A"}}]
[null,null,null,null,null,null,null,null,{"$f":"VLOOKUP(H73,'Drop down items'!B73:C4939,2,FALSE)","v":{"$error":"#N/A"}}]
[null,null,null,null,null,null,null,null,{"$f":"VLOOKUP(H74,'Drop down items'!B74:C4940,2,FALSE)","v":{"$error":"#N/A"}}]
[null,null,null,null,null,null,null,null,{"$f":"VLOOKUP(H75,'Drop down items'!B75:C4941,2,FALSE)","v":{"$error":"#N/A"}}]
[null,null,null,null,null,null,null,null,{"$f":"VLOOKUP(H76,'Drop down items'!B76:C4942,2,FALSE)","v":{"$error":"#N/A"}}]
[null,null,null,null,null,null,null,null,{"$f":"VLOOKUP(H77,'Drop down items'!B77:C4943,2,FALSE)","v":{"$error":"#N/A"}}]
[null,null,null,null,null,null,null,null,{"$f":"VLOOKUP(H78,'Drop down items'!B78:C4944,2,FALSE)","v":{"$error":"#N/A"}}]
[null,null,null,null,null,null,null,null,{"$f":"VLOOKUP(H79,'Drop down items'!B79:C4945,2,FALSE)","v":{"$error":"#N/A"}}]
[null,null,null,null,null,null,null,null,{"$f":"VLOOKUP(H80,'Drop down items'!B80:C4946,2,FALSE)","v":{"$error":"#N/A"}}]
[null,null,null,null,null,null,null,null,{"$f":"VLOOKUP(H81,'Drop down items'!B81:C4947,2,FALSE)","v":{"$error":"#N/A"}}]
[null,null,null,null,null,null,null,null,{"$f":"VLOOKUP(H82,'Drop down items'!B82:C4948,2,FALSE)","v":{"$error":"#N/A"}}]
[null,null,null,null,null,null,null,null,{"$f":"VLOOKUP(H83,'Drop down items'!B83:C4949,2,FALSE)","v":{"$error":"#N/A"}}]
[null,null,null,null,null,null,null,null,{"$f":"VLOOKUP(H84,'Drop down items'!B84:C4950,2,FALSE)","v":{"$error":"#N/A"}}]
[null,null,null,null,null,null,null,null,{"$f":"VLOOKUP(H85,'Drop down items'!B85:C4951,2,FALSE)","v":{"$error":"#N/A"}}]
[null,null,null,null,null,null,null,null,{"$f":"VLOOKUP(H86,'Drop down items'!B86:C4952,2,FALSE)","v":{"$error":"#N/A"}}]
[null,null,null,null,null,null,null,null,{"$f":"VLOOKUP(H87,'Drop down items'!B87:C4953,2,FALSE)","v":{"$error":"#N/A"}}]
[null,null,null,null,null,null,null,null,{"$f":"VLOOKUP(H88,'Drop down items'!B88:C4954,2,FALSE)","v":{"$error":"#N/A"}}]
[null,null,null,null,null,null,null,null,{"$f":"VLOOKUP(H89,'Drop down items'!B89:C4955,2,FALSE)","v":{"$error":"#N/A"}}]
[null,null,null,null,null,null,null,null,{"$f":"VLOOKUP(H90,'Drop down items'!B90:C4956,2,FALSE)","v":{"$error":"#N/A"}}]
[null,null,null,null,null,null,null,null,{"$f":"VLOOKUP(H91,'Drop down items'!B91:C4957,2,FALSE)","v":{"$error":"#N/A"}}]
[null,null,null,null,null,null,null,null,{"$f":"VLOOKUP(H92,'Drop down items'!B92:C4958,2,FALSE)","v":{"$error":"#N/A"}}]
[null,null,null,null,null,null,null,null,{"$f":"VLOOKUP(H93,'Drop down items'!B93:C4959,2,FALSE)","v":{"$error":"#N/A"}}]
[null,null,null,null,null,null,null,null,{"$f":"VLOOKUP(H94,'Drop down items'!B94:C4960,2,FALSE)","v":{"$error":"#N/A"}}]
[null,null,null,null,null,null,null,null,{"$f":"VLOOKUP(H95,'Drop down items'!B95:C4961,2,FALSE)","v":{"$error":"#N/A"}}]
[null,null,null,null,null,null,null,null,{"$f":"VLOOKUP(H96,'Drop down items'!B96:C4962,2,FALSE)","v":{"$error":"#N/A"}}]
[null,null,null,null,null,null,null,null,{"$f":"VLOOKUP(H97,'Drop down items'!B97:C4963,2,FALSE)","v":{"$error":"#N/A"}}]
[null,null,null,null,null,null,null,null,{"$f":"VLOOKUP(H98,'Drop down items'!B98:C4964,2,FALSE)","v":{"$error":"#N/A"}}]
[null,null,null,null,null,null,null,null,{"$f":"VLOOKUP(H99,'Drop down items'!B99:C4965,2,FALSE)","v":{"$error":"#N/A"}}]
[null,null,null,null,null,null,null,null,{"$f":"VLOOKUP(H100,'Drop down items'!B100:C4966,2,FALSE)","v":{"$error":"#N/A"}}]
[null,null,null,null,null,null,null,null,{"$f":"VLOOKUP(H101,'Drop down items'!B101:C4967,2,FALSE)","v":{"$error":"#N/A"}}]
[null,null,null,null,null,null,null,null,{"$f":"VLOOKUP(H102,'Drop down items'!B102:C4968,2,FALSE)","v":{"$error":"#N/A"}}]
[null,null,null,null,null,null,null,null,{"$f":"VLOOKUP(H103,'Drop down items'!B103:C4969,2,FALSE)","v":{"$error":"#N/A"}}]
[null,null,null,null,null,null,null,null,{"$f":"VLOOKUP(H104,'Drop down items'!B104:C4970,2,FALSE)","v":{"$error":"#N/A"}}]
[null,null,null,null,null,null,null,null,{"$f":"VLOOKUP(H105,'Drop down items'!B105:C4971,2,FALSE)","v":{"$error":"#N/A"}}]
[null,null,null,null,null,null,null,null,{"$f":"VLOOKUP(H106,'Drop down items'!B106:C4972,2,FALSE)","v":{"$error":"#N/A"}}]
[null,null,null,null,null,null,null,null,{"$f":"VLOOKUP(H107,'Drop down items'!B107:C4973,2,FALSE)","v":{"$error":"#N/A"}}]
[null,null,null,null,null,null,null,null,{"$f":"VLOOKUP(H108,'Drop down items'!B108:C4974,2,FALSE)","v":{"$error":"#N/A"}}]
[null,null,null,null,null,null,null,null,{"$f":"VLOOKUP(H109,'Drop down items'!B109:C4975,2,FALSE)","v":{"$error":"#N/A"}}]
[null,null,null,null,null,null,null,null,{"$f":"VLOOKUP(H110,'Drop down items'!B110:C4976,2,FALSE)","v":{"$error":"#N/A"}}]
[null,null,null,null,null,null,null,null,{"$f":"VLOOKUP(H111,'Drop down items'!B111:C4977,2,FALSE)","v":{"$error":"#N/A"}}]
[null,null,null,null,null,null,null,null,{"$f":"VLOOKUP(H112,'Drop down items'!B112:C4978,2,FALSE)","v":{"$error":"#N/A"}}]
[null,null,null,null,null,null,null,null,{"$f":"VLOOKUP(H113,'Drop down items'!B113:C4979,2,FALSE)","v":{"$error":"#N/A"}}]
[null,null,null,null,null,null,null,null,{"$f":"VLOOKUP(H114,'Drop down items'!B114:C4980,2,FALSE)","v":{"$error":"#N/A"}}]
[null,null,null,null,null,null,null,null,{"$f":"VLOOKUP(H115,'Drop down items'!B115:C4981,2,FALSE)","v":{"$error":"#N/A"}}]
[null,null,null,null,null,null,null,null,{"$f":"VLOOKUP(H116,'Drop down items'!B116:C4982,2,FALSE)","v":{"$error":"#N/A"}}]
[null,null,null,null,null,null,null,null,{"$f":"VLOOKUP(H117,'Drop down items'!B117:C4983,2,FALSE)","v":{"$error":"#N/A"}}]
[null,null,null,null,null,null,null,null,{"$f":"VLOOKUP(H118,'Drop down items'!B118:C4984,2,FALSE)","v":{"$error":"#N/A"}}]
[null,null,null,null,null,null,null,null,{"$f":"VLOOKUP(H119,'Drop down items'!B119:C4985,2,FALSE)","v":{"$error":"#N/A"}}]
[null,null,null,null,null,null,null,null,{"$f":"VLOOKUP(H120,'Drop down items'!B120:C4986,2,FALSE)","v":{"$error":"#N/A"}}]
{"$rows_left_out":1881}
{"sheet":"New species","index":3,"n_rows":1,"n_cols":6,"rows_kept":1,"cut":false,"hidden":false,"merged":[]}
["SCIENTIFIC_NAME","APHIA_ID","ITIS_TSN","OTHER_ID","SOURCE_OTHER_ID","SPECIES_GROUP"]

{"sheet":"Drop down items","index":4,"n_rows":4868,"n_cols":9,"rows_kept":4868,"cut":false,"hidden":false,"merged":[]}
["Sampling group","Scientific_name","Species_ID","Day","Month","Year","Countries","Port name","Species_group"]
["Benthos","Abietinaria abietina",1403,1,1,2000,"Belgium","Brofjorden","Benthic Invertebrates"]
["Fouling","Ablabesmyia longistyla",994,2,2,2001,"Denmark","Cuxhaven","Birds"]
["Mobile Epifauna","Ablabesmyia monilis",995,3,3,2002,"Finland","Gdnask","Fish and Lamprey"]
["Phytoplankton","Ablabesmyia phatta",996,4,4,2003,"France","Gdynia","Macrophytes"]
["Zooplankton","Abludomelita obtusata",1424,5,5,2004,"Germany","Gothenburg","Mammals"]
[null,"Abra alba",1,6,6,2005,"Iceland","Hamburg","Phytoplankton"]
[null,"Abra nitida",2,7,7,2006,"Ireland","Hamina","Zooplankton"]
[null,"Abra prismatica",3,8,8,2007,"Luxembourg","Helsinki","Bacteria"]
[null,"Abramis brama",1425,9,9,2008,"The Netherlands","Hull"]
[null,"Abyssoninoe hibernica",1426,10,10,2009,"Norway","JadeWeser"]
[null,"Abyssoninoe scopa",1427,11,11,2010,"Portugal","Kiel"]
[null,"Acanthocardia echinata",1428,12,12,2011,"Spain","Kokkola"]
[null,"Acanthoceras zachariasii",4390,13,null,2012,"Sweden","Kotka"]
[null,"Acanthocyclops robustus",4391,14,null,2013,"Switzerland","Las Palmas"]
[null,"Acanthocyclops vernalis",4392,15,null,2014,"United Kingdom","Liepaja"]
[null,"Acanthocythereis dunelmensis",1429,16,null,2015,"Estonia","Malmö"]
[null,"Acanthodoris pilosa",1430,17,null,2016,"Latvia","Muuga"]
[null,"Acantholabrus palloni",4,18,null,2017,"Lithuania","Naantali"]
[null,"Acartia (Acanthacartia) bifilosa",5,19,null,2018,"Poland","Riga"]
[null,"Acartia (Acanthacartia) tonsa",6,20,null,2019,"Russia","Rotterdam"]
[null,"Acartia (Acartia) danae",7,21,null,2020,null,"Skoldvik"]
[null,"Acartia (Acartia) negligens",8,22,null,2021,null,"Świnoujście"]
[null,"Acartia (Acartiura) clausi",9,23,null,2022,null,"Szczecin"]
[null,"Acartia (Acartiura) discaudata",1431,24,null,2023,null,"Trelleborg"]
[null,"Acartia (Acartiura) longiremis",10,25,null,2024,null,"Turku"]
[null,"Acartia bifilosa",11,26,null,2025,null,"Ventspils"]
[null,"Acartia clausi",12,27,null,null,null,"Ystad marina"]
[null,"Acartia danae",13,28]
[null,"Acartia discaudata",1432,29]
[null,"Acartia longiremis",14,30]
[null,"Acartia negligens",15,31]
[null,"Acartia tonsa",16]
[null,"Acaulis primarius",1433]
[null,"Acentria ephemerella",997]
[null,"Acera bullata",1434]
[null,"Achnanthes brevipes",17]
[null,"Achnanthes hauckiana var. hauckiana",18]
[null,"Achnanthes lemmermannii",19]
[null,"Achnanthes longipes",20]
[null,"Achnanthes taeniata",21]
[null,"Achnanthidium delicatulum f. delicatulum",22]
[null,"Achnanthidium minutissimum",4393]
[null,"Acidostoma neglectum",1435]
[null,"Acidostoma nodiferum",1436]
[null,"Acidostoma obesum",1437]
[null,"Acidostoma sarsi",1438]
[null,"Acilius canaliculatus",998]
[null,"Acinetospora crinita",1439]
[null,"Acipenser baeri",1440]
[null,"Acipenser baerii",1441]
[null,"Acipenser gueldenstaedtii",1442]
[null,"Acipenser oxyrinchus",1443]
[null,"Acipenser ruthenus",1444]
[null,"Acipenser stellatus",1445]
[null,"Acipenser sturio",1446]
[null,"Acipenserobdella volgensis",4394]
[null,"Aclis minor",1447]
[null,"Aclis walleri",1448]
[null,"Acmira cerrutii",1449]
[null,"Acricotopus lucens",999]
[null,"Acrocephalus arundinaceus",4211]
[null,"Acrocephalus schoenobaenus",4212]
[null,"Acrocephalus scirpaceus",4210]
[null,"Acrochaete cladophorae",1450]
[null,"Acrochaete flustrae",1451]
[null,"Acrochaete heteroclada",1452]
[null,"Acrochaete inflata",1453]
[null,"Acrochaete leptochaete",1454]
[null,"Acrochaete operculata",1455]
[null,"Acrochaete repens",1456]
[null,"Acrochaete viridis",1457]
[null,"Acrochaete wittrockii",1458]
[null,"Acrochaetium attenuatum",1459]
[null,"Acrochaetium balticum",1460]
[null,"Acrochaetium catenulatum",1461]
[null,"Acrochaetium cytophagum",1462]
[null,"Acrochaetium daviesii",1463]
[null,"Acrochaetium densum",1464]
[null,"Acrochaetium dumontiae",1465]
[null,"Acrochaetium emergens",1466]
[null,"Acrochaetium endozoicum",1467]
[null,"Acrochaetium gynandrum",1468]
[null,"Acrochaetium hallandicum",1469]
[null,"Acrochaetium humile",1470]
[null,"Acrochaetium immersum",1471]
[null,"Acrochaetium kylinii",1472]
[null,"Acrochaetium leptonema",1473]
[null,"Acrochaetium macula",1474]
[null,"Acrochaetium microscopicum",1475]
[null,"Acrochaetium minimum",1476]
[null,"Acrochaetium moniliforme",1477]
[null,"Acrochaetium nemalii",1478]
[null,"Acrochaetium parvulum",1479]
[null,"Acrochaetium reductum",1480]
[null,"Acrochaetium rhipidandrum",1481]
[null,"Acrochaetium rosulatum",1482]
[null,"Acrochaetium savianum",1483]
[null,"Acrochaetium secundatum",1484]
[null,"Acrochaetium stilophorae",1485]
[null,"Acrochaetium strictum",1486]
[null,"Acrochaetium thuretii",1487]
[null,"Acrochaetium virgatulum",1488]
[null,"Acroloxus lacustris",1489]
[null,"Acrosiphonia arcta",1490]
[null,"Acrosiphonia centralis",1491]
[null,"Acrosiphonia sonderi",1492]
[null,"Acrothrix gracilis",1493]
[null,"Acteon tornatilis",1494]
[null,"Actinastrum hantzschii",4303]
[null,"Actinia equina",1495]
[null,"Actinocyclus normanii",23]
[null,"Actinocyclus normanii f. normanii",4847]
[null,"Actinocyclus normanii f. subsalsus",4395]
[null,"Actinocyclus octonarius",24]
[null,"Actinocyclus octonarius var. crassus",4396]
[null,"Actinocyclus octonarius var. octonarius",4397]
[null,"Actinocyclus senarius",25]
[null,"Actinocythereis dunelmensis",1496]
[null,"Actinoptychus octonarius",26]
{"$rows_left_out":4748}